health thread
type: Class
comment: defined association between health matters as determined by one or more care actors
has metadata:
  namespace: directives.org.iso
  key: admittedTerms
  value: health thread
has metadata:
  namespace: directives.org.iso
  key: clauseType
  value: bodyAndTerm
has metadata:
  namespace: directives.org.iso
  key: example1
  value: A low back pain, known for many years by the subject of care’s general practitioner (GP), treated several times by the physiotherapist who labelled it a scoliosis and currently a candidate for a specific orthopaedic intervention.
has metadata:
  namespace: directives.org.iso
  key: example2
  value: Type 2 diabetes treated by a GP, a nurse, an endocrinologist and a vascular surgeon.
has metadata:
  namespace: directives.org.iso
  key: example3
  value: The health conditions included in a care process.
has metadata:
  namespace: directives.org.iso
  key: figureTitle
  value: Figure 12 — health thread (UML Representation)
has metadata:
  namespace: directives.org.iso
  key: note 1
  value: A health thread reconciles a range of health matters reflecting the variety of scopes of care actors, particularly of care providers.
has metadata:
  namespace: directives.org.iso
  key: note 2
  value: A health thread may be established by a team (e.g. a coordination committee).
has metadata:
  namespace: directives.org.iso
  key: note 3
  value: A health thread can be built step-by-step, by allowing each care professional to add their perspective into a common health thread.
has metadata:
  namespace: directives.org.iso
  key: note 4
  value: Under the responsibility of a designated care actor, a health thread linking several health matters can describe an episodes of care bundle, for instance a partial or comprehensive synthesis of care actor-related episodes of care.
has metadata:
  namespace: directives.org.iso
  key: note 5
  value: A collective decision (before, during or after the care interventions) may define a health thread and so the idea of the “episode” accepted by all the care professionals involved.
has metadata:
  namespace: directives.org.iso
  key: note 6
  value: A health thread may be considered an aggregation of health matters or health threads, or both.
has metadata:
  namespace: directives.org.iso
  key: note 7
  value: N/A
has metadata:
  namespace: directives.org.iso
  key: plural
  value: health threads
has metadata:
  namespace: directives.org.iso
  key: termClause
  value: 3.2.11
has metadata:
  namespace: directives.org.iso
  key: _profiled
  value: Yes
has metadata:
  namespace: uk.ac.ox.softeng.maurodatamapper.xmi
  key: isAbstract
  value: false
subclass of: knowledge
subclass of: Restriction
  max qualified cardinality: 1
  on class: episodes of care bundle
subclass of: Restriction
  max qualified cardinality: 1
  on class: health concern

health problem list
subclass of: health thread