health state
type: Class
comment: overall level of health of a subject of care
has metadata:
  namespace: directives.org.iso
  key: figureTitle
  value: Figure 2 — health state (UML Representation)
has metadata:
  namespace: directives.org.iso
  key: note 1
  value: Health is aspirational.
has metadata:
  namespace: directives.org.iso
  key: note 2
  value: The underlying health state is present, even if not observed. For example, the subject of care having a cancer before it gives symptoms.
has metadata:
  namespace: directives.org.iso
  key: plural
  value: health states
has metadata:
  namespace: directives.org.iso
  key: termClause
  value: 3.2.1
has metadata:
  namespace: directives.org.iso
  key: _profiled
  value: Yes
has metadata:
  namespace: ontology.external
  key: iri.dolce
  value: https://w3id.org/DOLCE/OWL/DOLCEbasic#State
has metadata:
  namespace: ontology.external
  key: prefix.dolce
  value: db
has metadata:
  namespace: ontology.external
  key: rdfsSubClassOf.dolce
  value: https://w3id.org/DOLCE/OWL/DOLCEbasic#State
has metadata:
  namespace: ontology.type
  key: ontologyId
  value: dolce=State
subclass of: State
subclass of: Restriction
  qualified cardinality: 1
  on class: person

output health state
subclass of: health state

input health state
subclass of: health state