health record
type: Class
has metadata:
  key: clauseType
  namespace: directives.org.iso
  value: bodyAndTerm
has metadata:
  key: figureTitle
  namespace: directives.org.iso
  value: Figure 132 — health record (UML Representation)
has metadata:
  key: note 1
  namespace: directives.org.iso
  value: A health record may include, for example, medical records, dental records, social care provider activity records.
has metadata:
  key: plural
  namespace: directives.org.iso
  value: health records
has metadata:
  key: termClause
  namespace: directives.org.iso
  value: 3.9.5
has metadata:
  key: _profiled
  namespace: directives.org.iso
  value: Yes
has metadata:
  key: isAbstract
  namespace: uk.ac.ox.softeng.maurodatamapper.xmi
  value: true
comment: data repository regarding the health and care of a subject of care
subclass of: care resource
subclass of: data repository
subclass of: Restriction
  min qualified cardinality: 1
  on class: subject of care

personal health record
subclass of: health record

professional health record
subclass of: health record