health problem list
has metadata:
  namespace: directives.org.iso
  key: admittedTerms
  value: care problem list
has metadata:
  namespace: directives.org.iso
  key: figureTitle
  value: Figure 13 — health problem list (UML Representation)
has metadata:
  namespace: directives.org.iso
  key: plural
  value: health problem lists
has metadata:
  namespace: directives.org.iso
  key: termClause
  value: 3.2.12
has metadata:
  namespace: directives.org.iso
  key: _profiled
  value: Yes
has metadata:
  namespace: uk.ac.ox.softeng.maurodatamapper.xmi
  key: isAbstract
  value: false
type: Class
comment: health thread linking a set of health problems
subclass of: health thread