health problem
has metadata:
  namespace: directives.org.iso
  key: figureTitle
  value: Figure 11 — health problem (UML Representation)
has metadata:
  namespace: directives.org.iso
  key: note 1
  value: Health problems can be single observations but are usually more compound as a summary of several observations. Single observations are often criteria for the more compound health condition considered to be a health problem.
has metadata:
  namespace: directives.org.iso
  key: plural
  value: health problems
has metadata:
  namespace: directives.org.iso
  key: termClause
  value: 3.2.10
has metadata:
  namespace: directives.org.iso
  key: _profiled
  value: Yes
has metadata:
  namespace: uk.ac.ox.softeng.maurodatamapper.xmi
  key: isAbstract
  value: false
type: Class
comment: health issue considered by a care actor to be a problem
subclass of: health issue