health need
type: Class
comment: health matter causing a deficit in the current health state compared to aspects of a desired future health state
has metadata:
  namespace: directives.org.iso
  key: clauseType
  value: bodyAndTerm
has metadata:
  namespace: directives.org.iso
  key: figureTitle
  value: Figure 26 — health need (UML Representation)
has metadata:
  namespace: directives.org.iso
  key: note 1
  value: The desired future health state can be an intended outcome expressed as target condition.
has metadata:
  namespace: directives.org.iso
  key: note 2
  value: The health need can be identified and formulated by the subject of care or by any other care actor.
has metadata:
  namespace: directives.org.iso
  key: note 3
  value: Health needs indicate and motivate care activities. They are the basic input to care needs assessments.
has metadata:
  namespace: directives.org.iso
  key: plural
  value: health needs
has metadata:
  namespace: directives.org.iso
  key: termClause
  value: 3.2.25
has metadata:
  namespace: directives.org.iso
  key: _profiled
  value: Yes
has metadata:
  namespace: uk.ac.ox.softeng.maurodatamapper.xmi
  key: isAbstract
  value: false
subclass of: health matter
subclass of: Restriction
  qualified cardinality: 1
  on class: health state

clinical need
subclass of: health need

social need
subclass of: health need