health condition period
type: Concept
broader: health related period
definition: health related period during which a health condition has been observed
in scheme: contsys.org
note: NOTE 1 Observation of a health condition may lead to an episode of care NOTE 2 Health condition period refers only to the observation of the health condition, for example, the time interval during which a subject of care has observed a bleeding. The concept episode of care is referring to the healthcare activities.
related: observed condition

hasPart
type: Property
comment: Expresses a partitive relationship between two concepts.
sub property of: narrower
inverse of: isPartOf

isPartOf
type: Property
comment: Expresses a partitive relationship between two concepts.
sub property of: broader
inverse of: hasPart