health condition delay
subclass of: health condition period

health condition period
has metadata:
  namespace: directives.org.iso
  key: clauseType
  value: bodyAndTerm
has metadata:
  namespace: directives.org.iso
  key: figureTitle
  value: Figure 83 — health condition period (UML Representation)
has metadata:
  namespace: directives.org.iso
  key: note 1
  value: Health condition period refers only to the observation of the health condition for example, the time interval during which a subject of care has observed a bleeding. The concept episode of care is referring to the care activities.
has metadata:
  namespace: directives.org.iso
  key: plural
  value: health condition periods
has metadata:
  namespace: directives.org.iso
  key: termClause
  value: 3.6.2
has metadata:
  namespace: directives.org.iso
  key: _profiled
  value: Yes
has metadata:
  namespace: uk.ac.ox.softeng.maurodatamapper.xmi
  key: isAbstract
  value: false
type: Class
comment: health related period during which a health condition has been observed
subclass of: health related period