health condition delay
type: Class
comment: care activity delay caused by a health condition
has metadata:
  namespace: directives.org.iso
  key: clauseType
  value: bodyAndTerm
has metadata:
  namespace: directives.org.iso
  key: example1
  value: Surgery delayed because the subject of care is pregnant.
has metadata:
  namespace: directives.org.iso
  key: example2
  value: Cervical examination delayed during menstruation.
has metadata:
  namespace: directives.org.iso
  key: example3
  value: Vaccination delayed because the subject of care has a contraindicating infection.
has metadata:
  namespace: directives.org.iso
  key: figureTitle
  value: Figure 95 — health condition delay (UML Representation)
has metadata:
  namespace: directives.org.iso
  key: plural
  value: health condition delays
has metadata:
  namespace: directives.org.iso
  key: termClause
  value: 3.6.14
has metadata:
  namespace: directives.org.iso
  key: _profiled
  value: Yes
has metadata:
  namespace: uk.ac.ox.softeng.maurodatamapper.xmi
  key: isAbstract
  value: false
subclass of: health condition period
subclass of: care activity delay