health condition assessment
has metadata:
  namespace: directives.org.iso
  key: clauseType
  value: bodyAndTerm
has metadata:
  namespace: directives.org.iso
  key: figureTitle
  value: Figure 67 — health condition assessment (UML Representation)
has metadata:
  namespace: directives.org.iso
  key: plural
  value: health condition assessments
has metadata:
  namespace: directives.org.iso
  key: termClause
  value: 3.4.16
has metadata:
  namespace: directives.org.iso
  key: _profiled
  value: Yes
has metadata:
  namespace: uk.ac.ox.softeng.maurodatamapper.xmi
  key: isAbstract
  value: false
type: Class
comment: care activity where an assessment related to health conditions of the subject of care is made
subclass of: care assessment