health concern
type: Class
has metadata:
  key: clauseType
  namespace: directives.org.iso
  value: bodyAndTerm
has metadata:
  key: figureTitle
  namespace: directives.org.iso
  value: Figure 143 — health concern (UML Representation)
has metadata:
  key: note 1
  namespace: directives.org.iso
  value: A concern is a collection of information supporting continuity of care for a subject of care. A health thread can include care activities, health conditions, care activity planning, activity management, evaluations and assessments. Thereby, all information needed for continuity of care for an individual subject of care can be covered by a health concern.
has metadata:
  key: note 2
  namespace: directives.org.iso
  value: Health concerns can be constructed to support continuity of care for care processes, continuity of care processes and accumulations or associations of continuity of care processes. This means that concerns can relate to episodes of care contacts, chronic disease management, multiple chronic disease management, etc.
has metadata:
  key: note 3
  namespace: directives.org.iso
  value: Health concerns can be represented and labelled in electronic health records (EHRs) as extracts or components.
has metadata:
  key: note 4
  namespace: directives.org.iso
  value: Health concern is closely related to the “concern tracking” based on HL7 standards.
has metadata:
  key: plural
  namespace: directives.org.iso
  value: health concerns
has metadata:
  key: termClause
  namespace: directives.org.iso
  value: 3.9.16
has metadata:
  key: _profiled
  namespace: directives.org.iso
  value: Yes
has metadata:
  key: isAbstract
  namespace: uk.ac.ox.softeng.maurodatamapper.xmi
  value: false
comment: health record extract that includes all health record components associated with a health thread
subclass of: health record extract