health certificate
type: Class
comment: official document issued by a care actor attesting to the relevant health matters of a subject of care
has metadata:
  namespace: directives.org.iso
  key: admittedTerms
  value: certificate related to a health matter
has metadata:
  namespace: directives.org.iso
  key: clauseType
  value: bodyAndTerm
has metadata:
  namespace: directives.org.iso
  key: deprecatedTerms
  value: specific care information request
has metadata:
  namespace: directives.org.iso
  key: example1
  value: Birth certificate.
has metadata:
  namespace: directives.org.iso
  key: example2
  value: Death certificate.
has metadata:
  namespace: directives.org.iso
  key: example3
  value: Health certificate.
has metadata:
  namespace: directives.org.iso
  key: example4
  value: Health insurance certificate.
has metadata:
  namespace: directives.org.iso
  key: example5
  value: Vaccination passport.
has metadata:
  namespace: directives.org.iso
  key: figureTitle
  value: Figure 149 — health certificate (UML Representation)
has metadata:
  namespace: directives.org.iso
  key: plural
  value: health certificates
has metadata:
  namespace: directives.org.iso
  key: termClause
  value: 3.9.22
has metadata:
  namespace: directives.org.iso
  key: _profiled
  value: Yes
has metadata:
  namespace: uk.ac.ox.softeng.maurodatamapper.xmi
  key: isAbstract
  value: false
subclass of: health report
subclass of: Restriction
  min qualified cardinality: 1
  on class: health matter