folder
type: Class
has metadata:
  key: admittedTerms
  namespace: directives.org.iso
  value: folder
has metadata:
  key: clauseType
  namespace: directives.org.iso
  value: bodyAndTerm
has metadata:
  key: figureTitle
  namespace: directives.org.iso
  value: Figure 151 — folder (UML Representation)
has metadata:
  key: note 1
  namespace: directives.org.iso
has metadata:
  key: plural
  namespace: directives.org.iso
  value: folders
has metadata:
  key: termClause
  namespace: directives.org.iso
  value: 3.9.24
has metadata:
  key: _profiled
  namespace: directives.org.iso
  value: Yes
has metadata:
  key: isAbstract
  namespace: uk.ac.ox.softeng.maurodatamapper.xmi
  value: false
comment: record component used for creating hierarchical structures within an electronic health record extract and with compositions as leaf nodes
subclass of: health record component