facility
has metadata:
  namespace: directives.org.iso
  key: figureTitle
  value: Figure 51 — facility (UML Representation)
has metadata:
  namespace: directives.org.iso
  key: termClause
  value: 3.3.23
has metadata:
  namespace: ontology.external
  key: iri.dolce
  value: https://w3id.org/DOLCE/OWL/DOLCEbasic#PhysicalObject
has metadata:
  namespace: ontology.external
  key: prefix.dolce
  value: db
has metadata:
  namespace: ontology.external
  key: rdfsSubClassOf.dolce
  value: https://w3id.org/DOLCE/OWL/DOLCEbasic#PhysicalObject
has metadata:
  namespace: ontology.type
  key: ontologyId
  value: dolce=PhysicalObject
type: Class
comment: place, building or equipment used for a particular purpose
subclass of: care resource
subclass of: PhysicalObject