excluded condition
type: Class
comment: considered condition that one or more care professionals have determined not to be consistent with the known observed conditions
has metadata:
  namespace: directives.org.iso
  key: admittedTerms
  value: discounted condition, non-verified condition, ruled out condition, ruled out considered condition
has metadata:
  namespace: directives.org.iso
  key: figureTitle
  value: Figure 19 — excluded condition (UML Representation)
has metadata:
  namespace: directives.org.iso
  key: plural
  value: excluded conditions
has metadata:
  namespace: directives.org.iso
  key: termClause
  value: 3.2.18
has metadata:
  namespace: directives.org.iso
  key: _profiled
  value: Yes
has metadata:
  namespace: uk.ac.ox.softeng.maurodatamapper.xmi
  key: isAbstract
  value: false
subclass of: considered condition
subclass of: Restriction
  min qualified cardinality: 1
  on class: observed condition