entry
type: Class
comment: health record component that represents the data documenting one observation or a series of related observations, or a statement, an explanation of reasoning, a care intention, plan or action
has metadata:
  namespace: directives.org.iso
  key: admittedTerms
  value: entry
has metadata:
  namespace: directives.org.iso
  key: clauseType
  value: bodyAndTerm
has metadata:
  namespace: directives.org.iso
  key: figureTitle
  value: Figure 153 — entry (UML Representation)
has metadata:
  namespace: directives.org.iso
  key: plural
  value: entries
has metadata:
  namespace: directives.org.iso
  key: termClause
  value: 3.9.26
has metadata:
  namespace: directives.org.iso
  key: _profiled
  value: Yes
has metadata:
  namespace: uk.ac.ox.softeng.maurodatamapper.xmi
  key: isAbstract
  value: false
subclass of: health record component
subclass of: Restriction
  min qualified cardinality: 1
  on class: composition