encounter
type: Class
comment: care activity period during which a contact occurs
has metadata:
  namespace: directives.org.iso
  key: admittedTerms
  value: contact period
has metadata:
  namespace: directives.org.iso
  key: clauseType
  value: bodyAndTerm
has metadata:
  namespace: directives.org.iso
  key: figureTitle
  value: Figure 90 — encounter (UML Representation)
has metadata:
  namespace: directives.org.iso
  key: note 1
  value: Since during a contact more than one health issue may be addressed, it may relate to more than one care process and more than one episode of care.
has metadata:
  namespace: directives.org.iso
  key: plural
  value: contact periods
has metadata:
  namespace: directives.org.iso
  key: termClause
  value: 3.6.9
has metadata:
  namespace: directives.org.iso
  key: _profiled
  value: Yes
has metadata:
  namespace: uk.ac.ox.softeng.maurodatamapper.xmi
  key: isAbstract
  value: false
subclass of: care activity period