discharge summary
has metadata:
  namespace: directives.org.iso
  key: clauseType
  value: bodyAndTerm
has metadata:
  namespace: directives.org.iso
  key: example1
  value: “Uniform Hospital Discharge Data Set” and “Uniform Ambulatory Medical Care Minimum Data Set” in the USA.
has metadata:
  namespace: directives.org.iso
  key: example2
  value: “Résumé de sortie standardisé” (RSS) or “Résumé d'Unité Médicale” (RUM) in France.
has metadata:
  namespace: directives.org.iso
  key: example3
  value: Nursing minimal data set (NMDS).
has metadata:
  namespace: directives.org.iso
  key: figureTitle
  value: Figure 142 — discharge summary (UML Representation)
has metadata:
  namespace: directives.org.iso
  key: note 1
  value: A discharge summary may be provided to the subject of care.
has metadata:
  namespace: directives.org.iso
  key: note 2
  value: One mandated period of care may be immediately followed by another; the next mandated care provider will then be a main recipient of the discharge summary.
has metadata:
  namespace: directives.org.iso
  key: note 3
  value: Discharge summaries are often meant to be processed so as to categorize hospital stays according to a statistically designed classification (such as the Diagnosis-Related Groups (DRGs) or other systems), usually for funding or epidemiological purposes.
has metadata:
  namespace: directives.org.iso
  key: plural
  value: discharge summaries
has metadata:
  namespace: directives.org.iso
  key: termClause
  value: 3.9.15
has metadata:
  namespace: directives.org.iso
  key: _profiled
  value: Yes
has metadata:
  namespace: uk.ac.ox.softeng.maurodatamapper.xmi
  key: isAbstract
  value: false
type: Class
comment: discharge report summarizing a mandated period of care
subclass of: discharge report