discharge report
type: Class
comment: health report concerning a completed mandated period of care
has metadata:
  namespace: directives.org.iso
  key: clauseType
  value: bodyAndTerm
has metadata:
  namespace: directives.org.iso
  key: example1
  value: Discharge letters.
has metadata:
  namespace: directives.org.iso
  key: figureTitle
  value: Figure 140 — discharge report (UML Representation)
has metadata:
  namespace: directives.org.iso
  key: plural
  value: discharge reports
has metadata:
  namespace: directives.org.iso
  key: termClause
  value: 3.9.13
has metadata:
  namespace: directives.org.iso
  key: _profiled
  value: Yes
has metadata:
  namespace: uk.ac.ox.softeng.maurodatamapper.xmi
  key: isAbstract
  value: false
subclass of: health report
subclass of: Restriction
  min qualified cardinality: 1
  on class: mandated period of care

discharge summary
subclass of: discharge report