demographic element
type: Concept
broader: demographic item
broader: electronic health record component
definition: record component within a demographic entity or demographic cluster containing a single data value
in scheme: contsys.org
related: data value

hasPart
type: Property
comment: Expresses a partitive relationship between two concepts.
sub property of: narrower
inverse of: isPartOf

isPartOf
type: Property
comment: Expresses a partitive relationship between two concepts.
sub property of: broader
inverse of: hasPart