core care plan
type: Concept
alternative label: standardized care plan
definition: reusable content and structure for a potential care plan for a specified set of circumstances
note: NOTE 1 A core care plan is usually based upon knowledge in clinical guidelines (including protocols). NOTE 2 Core care plans can be applied in healthcare planning as a clinical process management method. NOTE 3 A core care plan may include advanced formulated schemes for recommended healthcare activities.
related: care plan
related: clinical pathway
related: healthcare organization
top concept of: contsys.org

hasPart
type: Property
comment: Expresses a partitive relationship between two concepts.
sub property of: narrower
inverse of: isPartOf

isPartOf
type: Property
comment: Expresses a partitive relationship between two concepts.
sub property of: broader
inverse of: hasPart