core care plan
type: Class
comment: knowledge providing reusable content addressing one or more specified health issues
has metadata:
  namespace: directives.org.iso
  key: admittedTerms
has metadata:
  namespace: directives.org.iso
  key: clauseType
  value: bodyAndTerm
has metadata:
  namespace: directives.org.iso
  key: figureTitle
  value: Figure 106 — core care plan (UML Representation)
has metadata:
  namespace: directives.org.iso
  key: note 1
  value: A core care plan is usually based upon knowledge in care guidelines (including protocols).
has metadata:
  namespace: directives.org.iso
  key: note 2
  value: Core care plans may be applied in care planning as a continuity of care process management method.
has metadata:
  namespace: directives.org.iso
  key: note 3
  value: A core care plan may include advanced formulated schemes for recommended care activities.
has metadata:
  namespace: directives.org.iso
  key: plural
  value: core care plans
has metadata:
  namespace: directives.org.iso
  key: synonym
  value: standardized care plan
has metadata:
  namespace: directives.org.iso
  key: termClause
  value: 3.7.8
has metadata:
  namespace: directives.org.iso
  key: _profiled
  value: Yes
has metadata:
  namespace: uk.ac.ox.softeng.maurodatamapper.xmi
  key: isAbstract
  value: false
subclass of: knowledge