considered condition
type: Class
comment: potential health condition considered by a care actor based on one or more observed conditions
has metadata:
  namespace: directives.org.iso
  key: admittedTerms
  value: considered health condition
has metadata:
  namespace: directives.org.iso
  key: figureTitle
  value: Figure 16 — considered condition (UML Representation)
has metadata:
  namespace: directives.org.iso
  key: note 1
  value: A request for care normally includes a health condition or symptom observed by the subject of care and also a question about what the reason for that symptom might be. It is the potential health condition in this question (the health condition behind the symptom) that is called a considered condition.
has metadata:
  namespace: directives.org.iso
  key: note 2
  value: A referral within a continuity of care process is normally motivated by one or several observed conditions or professionally assessed conditions. However, the referral also normally includes a question that the care investigation is supposed to get an answer to. The question formulated as a potential condition is a considered condition.
has metadata:
  namespace: directives.org.iso
  key: note 3
  value: A considered condition remains considered until the associated observed conditions are changed or completed. Care investigation or care treatment can result in new observations that can verify or not verify the considered condition. When a considered condition is verified, it becomes an observed condition or professionally assessed condition that may be a working diagnosis. If a considered condition is discounted, it is transformed into an excluded condition.
has metadata:
  namespace: directives.org.iso
  key: plural
  value: considered conditions
has metadata:
  namespace: directives.org.iso
  key: termClause
  value: 3.2.15
has metadata:
  namespace: directives.org.iso
  key: _profiled
  value: Yes
has metadata:
  namespace: uk.ac.ox.softeng.maurodatamapper.xmi
  key: isAbstract
  value: false
subclass of: potential health condition
subclass of: Restriction
  min qualified cardinality: 1
  on class: observed condition

excluded condition
subclass of: considered condition

professionally assessed condition
subclass of: considered condition