consent competence
type: Concept
definition: capability of the subject of care and/or the subject of care proxy to give informed consent or dissent
related: dissent
related: informed consent
related: subject of care
related: subject of care proxy
top concept of: contsys.org

hasPart
type: Property
comment: Expresses a partitive relationship between two concepts.
sub property of: narrower
inverse of: isPartOf

isPartOf
type: Property
comment: Expresses a partitive relationship between two concepts.
sub property of: broader
inverse of: hasPart