composition
type: Class
has metadata:
  key: admittedTerms
  namespace: directives.org.iso
  value: composition
has metadata:
  key: clauseType
  namespace: directives.org.iso
  value: bodyAndTerm
has metadata:
  key: figureTitle
  namespace: directives.org.iso
  value: Figure 152 — composition (UML Representation)
has metadata:
  key: note 1
  namespace: directives.org.iso
  value: A composition represents the set of record components composed (authored) during one clinical encounter or documentation session and committed within one health record.
has metadata:
  key: plural
  namespace: directives.org.iso
  value: compositions
has metadata:
  key: termClause
  namespace: directives.org.iso
  value: 3.9.25
has metadata:
  key: _profiled
  namespace: directives.org.iso
  value: Yes
has metadata:
  key: isAbstract
  namespace: uk.ac.ox.softeng.maurodatamapper.xmi
  value: false
comment: health record component containing information composed during one clinical encounter or documentation session, and committed within one health record
subclass of: health record component
subclass of: Restriction
  min qualified cardinality: 1
  on class: folder