coded simple value
type: Concept
broader: data value
definition: data value used for representing a code in a code system implied and fixed by the context in which this data value occurs
in scheme: contsys.org
note: NOTE This DATA_VALUE specialization is equivalent to ISO 21090:2011 CS data type.

hasPart
type: Property
comment: Expresses a partitive relationship between two concepts.
sub property of: narrower
inverse of: isPartOf

isPartOf
type: Property
comment: Expresses a partitive relationship between two concepts.
sub property of: broader
inverse of: hasPart