clinical care
type: Class
comment: care activity concerned with physical or mental health needs
has metadata:
  namespace: directives.org.iso
  key: figureTitle
  value: Figure 4 — clinical care (UML Representation)
has metadata:
  namespace: directives.org.iso
  key: termClause
  value: 3.2.3
has metadata:
  namespace: directives.org.iso
  key: _profiled
  value: Yes
subclass of: care activity