care treatment
type: Class
comment: care activity intended to directly improve or maintain a health state
has metadata:
  namespace: directives.org.iso
  key: clauseType
  value: bodyAndTerm
has metadata:
  namespace: directives.org.iso
  key: figureTitle
  value: Figure 65 — care treatment (UML Representation)
has metadata:
  namespace: directives.org.iso
  key: note 1
  value: The treatment of a subject of care’s health state based on that subject of care’s health conditions, is a part of the continuity of care process considered from a therapeutic perspective.
has metadata:
  namespace: directives.org.iso
  key: note 2
  value: Care treatment is intended to contribute to fulfilling the assessed health need.
has metadata:
  namespace: directives.org.iso
  key: note 3
  value: Prevention is a type of care treatment where the risk of a health condition is treated.
has metadata:
  namespace: directives.org.iso
  key: note 4
  value: Care treatment includes all types of activities that intend to influence the health state including, for example, rehabilitation, palliative care, education of subjects of care and carers, etc.
has metadata:
  namespace: directives.org.iso
  key: plural
  value: care treatments
has metadata:
  namespace: directives.org.iso
  key: termClause
  value: 3.4.14
has metadata:
  namespace: directives.org.iso
  key: _profiled
  value: Yes
has metadata:
  namespace: uk.ac.ox.softeng.maurodatamapper.xmi
  key: isAbstract
  value: false
subclass of: care activity
subclass of: Restriction
  qualified cardinality: 1
  on class: health state