care service offering
type: Class
has metadata:
  key: clauseType
  namespace: directives.org.iso
  value: bodyAndTerm
has metadata:
  key: figureTitle
  namespace: directives.org.iso
  value: Figure 61 — care service offering (UML Representation)
has metadata:
  key: note 1
  namespace: directives.org.iso
  value: A process consists of activities. These can be bundled in groups called services.
has metadata:
  key: note 2
  namespace: directives.org.iso
  value: A service can be an entire process or a part of a process. In the second case, the result of the service contributes to the outcome of the process.
has metadata:
  key: termClause
  namespace: directives.org.iso
  value: 3.4.10
has metadata:
  key: _profiled
  namespace: directives.org.iso
  value: Yes
has metadata:
  key: isAbstract
  namespace: uk.ac.ox.softeng.maurodatamapper.xmi
  value: false
comment: set of care activities offered by care provider
subclass of: knowledge
subclass of: Restriction
  on class: care service directory
  qualified cardinality: 0