care provider activity
type: Class
comment: care activity performed by a care provider
has metadata:
  namespace: directives.org.iso
  key: clauseType
  value: bodyAndTerm
has metadata:
  namespace: directives.org.iso
  key: figureTitle
  value: Figure 53 — care provider activity (UML Representation)
has metadata:
  namespace: directives.org.iso
  key: note 1
  value: A care provider activity can be performed in relation to several care activity period elements of the same care activity period.
has metadata:
  namespace: directives.org.iso
  key: termClause
  value: 3.4.2
has metadata:
  namespace: directives.org.iso
  key: _profiled
  value: Yes
has metadata:
  namespace: uk.ac.ox.softeng.maurodatamapper.xmi
  key: isAbstract
  value: false
subclass of: care activity
subclass of: Restriction
  min qualified cardinality: 1
  on class: care activity mandate
subclass of: Restriction
  min qualified cardinality: 1
  on class: health issue