care provider
type: Class
comment: care actor that is able to be assigned one or more care period mandates
has metadata:
  namespace: directives.org.iso
  key: clauseType
  value: bodyAndTerm
has metadata:
  namespace: directives.org.iso
  key: figureTitle
  value: Figure 31 — care provider (UML Representation)
has metadata:
  namespace: directives.org.iso
  key: note 1
  value: The personnel of a care organization that is a care provider may be care professionals and other care personnel who participate in the provision of care.
has metadata:
  namespace: directives.org.iso
  key: note 2
  value: This document includes only two specializations of care provider. This is not meant to exclude the possibility of other specializations. In jurisdictions where other kinds of care actors are included in the concept of care provider, the necessary specializations may be added.
has metadata:
  namespace: directives.org.iso
  key: note 3
  value: According to this definition, organizations solely responsible for the funding, payment, or reimbursement of care provision are not care providers; for the purpose of this document, they are considered as care third parties.
has metadata:
  namespace: directives.org.iso
  key: plural
  value: care providers
has metadata:
  namespace: directives.org.iso
  key: termClause
  value: 3.3.3
has metadata:
  namespace: directives.org.iso
  key: _profiled
  value: Yes
has metadata:
  namespace: uk.ac.ox.softeng.maurodatamapper.xmi
  key: isAbstract
  value: false
subclass of: care actor
subclass of: Restriction
  min qualified cardinality: 1
  on class: care service directory
subclass of: Restriction
  min qualified cardinality: 1
  on class: care service offering

care personnel
subclass of: care provider

care organization
subclass of: care provider