care professional
type: Class
comment: person holding a care professional entitlement
has metadata:
  namespace: directives.org.iso
  key: admittedTerms
  value: healthcare professional
has metadata:
  namespace: directives.org.iso
  key: clauseType
  value: bodyAndTerm
has metadata:
  namespace: directives.org.iso
  key: deprecatedTerms
  value: health professional
has metadata:
  namespace: directives.org.iso
  key: example1
  value: General practitioner, medical consultant, therapist, dentist, nurse, radiographer, social worker.
has metadata:
  namespace: directives.org.iso
  key: figureTitle
  value: Figure 37 — care professional (UML Representation)
has metadata:
  namespace: directives.org.iso
  key: note 1
  value: The care professional entitlement entitles a care professional to provide care independent of a role in a care organization.
has metadata:
  namespace: directives.org.iso
  key: plural
  value: care professionals
has metadata:
  namespace: directives.org.iso
  key: termClause
  value: 3.3.9
has metadata:
  namespace: directives.org.iso
  key: _profiled
  value: Yes
has metadata:
  namespace: uk.ac.ox.softeng.maurodatamapper.xmi
  key: isAbstract
  value: false
subclass of: care actor
subclass of: Restriction
  min qualified cardinality: 1
  on class: care professional entitlement
subclass of: Restriction
  max qualified cardinality: 1
  on class: prescriber