care process
has metadata:
  namespace: directives.org.iso
  key: admittedTerms
  value: care process
has metadata:
  namespace: directives.org.iso
  key: clauseType
  value: bodyAndTerm
has metadata:
  namespace: directives.org.iso
  key: figureTitle
  value: Figure 72 — care process (UML Representation)
has metadata:
  namespace: directives.org.iso
  key: note 1
  value: A care process is not by definition restricted to one care provider or any other organizational unit borders.
has metadata:
  namespace: directives.org.iso
  key: plural
  value: care processes
has metadata:
  namespace: directives.org.iso
  key: termClause
  value: 3.5.1
has metadata:
  namespace: directives.org.iso
  key: _profiled
  value: Yes
has metadata:
  namespace: ontology.external
  key: iri.dolce
  value: https://w3id.org/DOLCE/OWL/DOLCEbasic#Process
has metadata:
  namespace: ontology.external
  key: prefix.dolce
  value: db
has metadata:
  namespace: ontology.external
  key: rdfsSubClassOf.dolce
  value: https://w3id.org/DOLCE/OWL/DOLCEbasic#Process
has metadata:
  namespace: ontology.type
  key: ontologyId
  value: dolce=Process
has metadata:
  namespace: uk.ac.ox.softeng.maurodatamapper.xmi
  key: isAbstract
  value: false
type: Class
comment: set of interrelated or interacting care activities which transforms inputs into outputs
subclass of: Process
subclass of: Restriction
  max qualified cardinality: 1
  on class: care process
subclass of: Restriction
  qualified cardinality: 1
  on class: output health state
subclass of: Restriction
  min qualified cardinality: 1
  on class: health record
subclass of: Restriction
  min qualified cardinality: 1
  on class: care plan
subclass of: Restriction
  min qualified cardinality: 1
  on class: subject of care
subclass of: Restriction
  qualified cardinality: 1
  on class: care service

continuity of care process
subclass of: care process