care planning
type: Class
comment: care activity management where a care plan is managed
has metadata:
  namespace: directives.org.iso
  key: admittedTerms
  value: care planning
has metadata:
  namespace: directives.org.iso
  key: clauseType
  value: bodyAndTerm
has metadata:
  namespace: directives.org.iso
  key: figureTitle
  value: Figure 99 — care planning (UML Representation)
has metadata:
  namespace: directives.org.iso
  key: plural
  value: care planning
has metadata:
  namespace: directives.org.iso
  key: termClause
  value: 3.7.1
has metadata:
  namespace: directives.org.iso
  key: _profiled
  value: Yes
has metadata:
  namespace: uk.ac.ox.softeng.maurodatamapper.xmi
  key: isAbstract
  value: false
subclass of: care activity management