care plan
type: Concept
alternative label: healthcare plan
alternative label: programme of care
definition: dynamic, personalized plan including identified needed healthcare activities, health objectives and healthcare goals, relating to one or more specified health issues in a healthcare process
example: EXAMPLE A care plan for retinopathy in diabetics by video-retinoscopy, which involves the GP and an ophthalmologist and implies specific mobile equipment (video-retinoscope) with a camera.
narrower: multi-professional care plan
narrower: uniprofessional care plan
note: NOTE 1 A care plan may be recorded in one or more health records. NOTE 2 A care plan could be subdivided from different perspectives by different constraints. One example is uniprofessional care plan, for example, a nursing care plan with the constraint of only one specific healthcare professional involved. Other examples of specific constraints for a care plan are: care plan to address one health issue, one health condition, one contact, one clinical process, healthcare activities to be performed by one healthcare provider, etc. NOTE 3 Care plans are reviewed repeatedly during a healthcare process, each review based on a new healthcare needs assessment. NOTE 4 The healthcare activities in a care plan follow a life cycle. Examples of statuses of such a life cycle are: 'planned', 'performed', 'cancelled', etc.; all of these statuses are included in the care plan. NOTE 5 In EN 13940-1:2007 programme of care was the preferred term for this concept.
related: clinical guideline
related: core care plan
related: health issue
related: health objective
related: health record
related: health thread
related: healthcare activities bundle
related: healthcare activity
related: healthcare activity management
related: healthcare actor
related: healthcare appointment
related: healthcare goal
related: healthcare planning
related: healthcare process
related: protocol
top concept of: contsys.org

hasPart
type: Property
comment: Expresses a partitive relationship between two concepts.
sub property of: narrower
inverse of: isPartOf

isPartOf
type: Property
comment: Expresses a partitive relationship between two concepts.
sub property of: broader
inverse of: hasPart