care personnel
type: Class
comment: person mandated through a care employment
has metadata:
  namespace: directives.org.iso
  key: clauseType
  value: bodyAndTerm
has metadata:
  namespace: directives.org.iso
  key: example1
  value: Nurse’s assistant, head of department, medical secretary, receptionist.
has metadata:
  namespace: directives.org.iso
  key: figureTitle
  value: Figure 35 — care personnel (UML Representation)
has metadata:
  namespace: directives.org.iso
  key: plural
  value: care personnel
has metadata:
  namespace: directives.org.iso
  key: termClause
  value: 3.3.7
has metadata:
  namespace: directives.org.iso
  key: _profiled
  value: Yes
has metadata:
  namespace: uk.ac.ox.softeng.maurodatamapper.xmi
  key: isAbstract
  value: false
subclass of: care provider
subclass of: care actor
subclass of: care resource