care pathway
has metadata:
  namespace: directives.org.iso
  key: clauseType
  value: bodyAndTerm
has metadata:
  namespace: directives.org.iso
  key: figureTitle
  value: Figure 104 — care pathway (UML Representation)
has metadata:
  namespace: directives.org.iso
  key: note 1
  value: The concept care pathway includes subtypes, for example, “integrated care pathways”, “multidisciplinary pathways of care collaborative care pathways”.
has metadata:
  namespace: directives.org.iso
  key: note 2
  value: Care pathways are designed to support care activity management. They provide detailed guidance for each stage in the management of a subject of care (treatments, interventions, etc.).
has metadata:
  namespace: directives.org.iso
  key: note 3
  value: Care pathways are knowledge supporting the design of core care plans.
has metadata:
  namespace: directives.org.iso
  key: plural
  value: care pathways
has metadata:
  namespace: directives.org.iso
  key: synonym
  value: care map, pathway of care
has metadata:
  namespace: directives.org.iso
  key: termClause
  value: 3.7.6
has metadata:
  namespace: directives.org.iso
  key: _profiled
  value: Yes
has metadata:
  namespace: uk.ac.ox.softeng.maurodatamapper.xmi
  key: isAbstract
  value: false
type: Class
comment: detailed guidance for each stage in the interdisciplinary management of a subject of care
subclass of: knowledge
subclass of: Restriction
  min qualified cardinality: 1
  on class: health issue