care needs assessment
type: Class
comment: care assessment during which a care professional considers a subject of care’shealth needs and determines needed care activities
has metadata:
  namespace: directives.org.iso
  key: figureTitle
  value: Figure 68 — care needs assessment (UML Representation)
has metadata:
  namespace: directives.org.iso
  key: note 1
  value: A care needs assessment precedes care planning.
has metadata:
  namespace: directives.org.iso
  key: note 2
  value: Care needs assessments should be performed in a dialogue with the subject of care. The responsibility for a care needs assessment is held by a care professional.
has metadata:
  namespace: directives.org.iso
  key: note 3
  value: Subjects of care interact with care professionals and describe their views and preferences about which care activities to request.
has metadata:
  namespace: directives.org.iso
  key: plural
  value: care needs assessments
has metadata:
  namespace: directives.org.iso
  key: termClause
  value: 3.4.17
has metadata:
  namespace: directives.org.iso
  key: _profiled
  value: Yes
has metadata:
  namespace: uk.ac.ox.softeng.maurodatamapper.xmi
  key: isAbstract
  value: false
subclass of: care assessment
subclass of: Restriction
  min qualified cardinality: 1
  on class: health condition