care investigation
type: Class
comment: care activity with the intention to clarify one or more health conditions of a subject of care
has metadata:
  namespace: directives.org.iso
  key: clauseType
  value: bodyAndTerm
has metadata:
  namespace: directives.org.iso
  key: figureTitle
  value: Figure 64 — care investigation (UML Representation)
has metadata:
  namespace: directives.org.iso
  key: note 1
  value: Care investigations add and improve information about aspects of a health state.
has metadata:
  namespace: directives.org.iso
  key: note 2
  value: Some primary care investigations may have an intended or secondary therapeutic effect, while some activities can be both investigative and therapeutic in nature (e.g. fibroscopy, interventional cardiology).
has metadata:
  namespace: directives.org.iso
  key: plural
  value: care investigations
has metadata:
  namespace: directives.org.iso
  key: termClause
  value: 3.4.13
has metadata:
  namespace: directives.org.iso
  key: _profiled
  value: Yes
has metadata:
  namespace: uk.ac.ox.softeng.maurodatamapper.xmi
  key: isAbstract
  value: false
subclass of: care activity
subclass of: Restriction
  qualified cardinality: 1
  on class: health state