care information request
type: Class
comment: request sent out by a care actor to another care actor for specific care information needed for the provision of care to a subject of care
has metadata:
  namespace: directives.org.iso
  key: admittedTerms
  value: specific care information request
has metadata:
  namespace: directives.org.iso
  key: clauseType
  value: bodyAndTerm
has metadata:
  namespace: directives.org.iso
  key: figureTitle
  value: Figure 148 — care information request (UML Representation)
has metadata:
  namespace: directives.org.iso
  key: note 1
  value: In order to fulfil the request, a mandate to export personal information is needed.
has metadata:
  namespace: directives.org.iso
  key: plural
  value: care information requests
has metadata:
  namespace: directives.org.iso
  key: termClause
  value: 3.9.21
has metadata:
  namespace: directives.org.iso
  key: _profiled
  value: Yes
has metadata:
  namespace: uk.ac.ox.softeng.maurodatamapper.xmi
  key: isAbstract
  value: false
subclass of: request for service
subclass of: Restriction
  min qualified cardinality: 1
  on class: health record extract