care information
has metadata:
  namespace: directives.org.iso
  key: clauseType
  value: bodyAndTerm
has metadata:
  namespace: directives.org.iso
  key: figureTitle
  value: Figure 130 — care information (UML Representation)
has metadata:
  namespace: directives.org.iso
  key: termClause
  value: 3.9.3
has metadata:
  namespace: directives.org.iso
  key: _profiled
  value: Yes
has metadata:
  namespace: uk.ac.ox.softeng.maurodatamapper.xmi
  key: isAbstract
  value: false
type: Class
comment: information about a person relevant to their care
subclass of: information

care information for import
subclass of: care information

non-ratified care information
subclass of: care information