care funds
type: Class
comment: resource provided for funding care delivery
has metadata:
  namespace: directives.org.iso
  key: clauseType
  value: bodyAndTerm
has metadata:
  namespace: directives.org.iso
  key: figureTitle
  value: Figure 50 — care funds (UML Representation)
has metadata:
  namespace: directives.org.iso
  key: note 1
  value: Funds may be provided by, for example, a health insurance fund, a governmental agency, a national or local authority, a welfare programme, the subject of care or any other person or organization having a role in the funding of care.
has metadata:
  namespace: directives.org.iso
  key: plural
  value: care funds
has metadata:
  namespace: directives.org.iso
  key: termClause
  value: 3.3.22
has metadata:
  namespace: directives.org.iso
  key: _profiled
  value: Yes
has metadata:
  namespace: uk.ac.ox.softeng.maurodatamapper.xmi
  key: isAbstract
  value: false
subclass of: resource
subclass of: Restriction
  min qualified cardinality: 1
  on class: care resource