care evaluation
has metadata:
  namespace: directives.org.iso
  key: admittedTerms
  value: care evaluation
has metadata:
  namespace: directives.org.iso
  key: clauseType
  value: bodyAndTerm
has metadata:
  namespace: directives.org.iso
  key: figureTitle
  value: Figure 71 — care evaluation (UML Representation)
has metadata:
  namespace: directives.org.iso
  key: note 1
  value: Care evaluation may be performed by any care actor, including the subject of care and relevant third parties.
has metadata:
  namespace: directives.org.iso
  key: plural
  value: care evaluations
has metadata:
  namespace: directives.org.iso
  key: termClause
  value: 3.4.20
has metadata:
  namespace: directives.org.iso
  key: _profiled
  value: Yes
has metadata:
  namespace: uk.ac.ox.softeng.maurodatamapper.xmi
  key: isAbstract
  value: false
type: Class
comment: care activity where aspects of at least one other care activity are evaluated
subclass of: care activity
subclass of: Restriction
  min qualified cardinality: 1
  on class: care activity

care process evaluation
subclass of: care evaluation