care documenting
type: Class
comment: care activity where health records are created or maintained
has metadata:
  namespace: directives.org.iso
  key: clauseType
  value: bodyAndTerm
has metadata:
  namespace: directives.org.iso
  key: figureTitle
  value: Figure 131 — care documenting (UML Representation)
has metadata:
  namespace: directives.org.iso
  key: plural
  value: care documenting
has metadata:
  namespace: directives.org.iso
  key: termClause
  value: 3.9.4
has metadata:
  namespace: directives.org.iso
  key: _profiled
  value: Yes
has metadata:
  namespace: uk.ac.ox.softeng.maurodatamapper.xmi
  key: isAbstract
  value: false
subclass of: care activity
subclass of: Restriction
  min qualified cardinality: 1
  on class: health record