care contact
has metadata:
  namespace: directives.org.iso
  key: clauseType
  value: bodyAndTerm
has metadata:
  namespace: directives.org.iso
  key: example1
  value: Face to face contact with a general practitioner.
has metadata:
  namespace: directives.org.iso
  key: example2
  value: Telephone contact.
has metadata:
  namespace: directives.org.iso
  key: example3
  value: Telemedicine contact.
has metadata:
  namespace: directives.org.iso
  key: example4
  value: Family visit at the social worker’s office.
has metadata:
  namespace: directives.org.iso
  key: figureTitle
  value: Figure 88 — care contact (UML Representation)
has metadata:
  namespace: directives.org.iso
  key: plural
  value: care contacts
has metadata:
  namespace: directives.org.iso
  key: termClause
  value: 3.6.7
has metadata:
  namespace: directives.org.iso
  key: _profiled
  value: Yes
has metadata:
  namespace: uk.ac.ox.softeng.maurodatamapper.xmi
  key: isAbstract
  value: false
type: Class
comment: interaction between one or more subjects of care and one or more care personnel
subclass of: event
subclass of: Restriction
  qualified cardinality: 1
  on class: encounter

initial contact
subclass of: care contact