care assessment
type: Class
comment: care activity where an opinion is formed about health conditions of a subject of care
has metadata:
  namespace: directives.org.iso
  key: figureTitle
  value: Figure 66 — care assessment (UML Representation)
has metadata:
  namespace: directives.org.iso
  key: plural
  value: care assessments
has metadata:
  namespace: directives.org.iso
  key: termClause
  value: 3.4.15
has metadata:
  namespace: directives.org.iso
  key: _profiled
  value: Yes
has metadata:
  namespace: uk.ac.ox.softeng.maurodatamapper.xmi
  key: isAbstract
  value: false
subclass of: care activity

care needs assessment
subclass of: care assessment

health condition assessment
subclass of: care assessment