care activity mandate
type: Class
comment: care mandate assigning the right and obligation to perform specific care activities
has metadata:
  namespace: directives.org.iso
  key: admittedTerms
  value: care activity commission
has metadata:
  namespace: directives.org.iso
  key: clauseType
  value: bodyAndTerm
has metadata:
  namespace: directives.org.iso
  key: figureTitle
  value: Figure 120 — care activity mandate (UML Representation)
has metadata:
  namespace: directives.org.iso
  key: plural
  value: care activity mandates
has metadata:
  namespace: directives.org.iso
  key: termClause
  value: 3.8.8
has metadata:
  namespace: directives.org.iso
  key: _profiled
  value: Yes
has metadata:
  namespace: uk.ac.ox.softeng.maurodatamapper.xmi
  key: isAbstract
  value: false
subclass of: care mandate

social care activity mandate
subclass of: care activity mandate

clinical care activity mandate
subclass of: care activity mandate