care activity management
type: Class
comment: care activity during which the status of care activities in a care plan are changed
has metadata:
  namespace: directives.org.iso
  key: admittedTerms
  value: care activity management
has metadata:
  namespace: directives.org.iso
  key: clauseType
  value: bodyAndTerm
has metadata:
  namespace: directives.org.iso
  key: figureTitle
  value: Figure 70 — care activity management (UML Representation)
has metadata:
  namespace: directives.org.iso
  key: note 1
  value: Example statuses for care activities are: planned, scheduled, resource allocated, ongoing, performed, evaluated.
has metadata:
  namespace: directives.org.iso
  key: plural
  value: care activities management
has metadata:
  namespace: directives.org.iso
  key: termClause
  value: 3.4.19
has metadata:
  namespace: directives.org.iso
  key: _profiled
  value: Yes
has metadata:
  namespace: uk.ac.ox.softeng.maurodatamapper.xmi
  key: isAbstract
  value: false
subclass of: care activity
subclass of: Restriction
  min qualified cardinality: 1
  on class: care activity

care planning
subclass of: care activity management