automatic medical device
type: Class
comment: medical device capable of performing care activities by itself or under human supervision
has metadata:
  namespace: directives.org.iso
  key: clauseType
  value: bodyAndTerm
has metadata:
  namespace: directives.org.iso
  key: example1
  value: An electrocardiography machine.
has metadata:
  namespace: directives.org.iso
  key: example2
  value: Electronic blood-sugar monitor.
has metadata:
  namespace: directives.org.iso
  key: figureTitle
  value: Figure 48 — automatic medical device (UML Representation)
has metadata:
  namespace: directives.org.iso
  key: plural
  value: automatic medical devices
has metadata:
  namespace: directives.org.iso
  key: termClause
  value: 3.3.20
has metadata:
  namespace: directives.org.iso
  key: _profiled
  value: Yes
has metadata:
  namespace: uk.ac.ox.softeng.maurodatamapper.xmi
  key: isAbstract
  value: false
subclass of: medical device