automated healthcare
type: Concept
definition: method of delivering healthcare initiated by a responsible healthcare actor and thereafter delivered automatically by an automatic medical device
example: EXAMPLE Activities performed by the machine during a long term Electrocardiography (“Holter recording”) programme, implanted cardiac defibrillator.
note: NOTE Automated healthcare is not a healthcare activity in its own right since the automatic medical device doesn't have the capacity to be responsible. It is the healthcare actor who initiates and reviews the automated healthcare that is responsible for safe use of the automatic medical device.
related: automatic medical device
related: healthcare activity
related: healthcare actor
related: non-ratified healthcare information
top concept of: contsys.org

hasPart
type: Property
comment: Expresses a partitive relationship between two concepts.
sub property of: narrower
inverse of: isPartOf

isPartOf
type: Property
comment: Expresses a partitive relationship between two concepts.
sub property of: broader
inverse of: hasPart